[GNU Autoconf 2.69] testsuite: 503 failed

classic Classic list List threaded Threaded
1 message Options
Reply | Threaded
Open this post in threaded view
|  
Report Content as Inappropriate

[GNU Autoconf 2.69] testsuite: 503 failed

Fergus McMenemie


Darwin macbookpro-3.local 16.4.0 Darwin Kernel Version 16.4.0: Thu Dec 22 22:53:21 PST 2016; root:xnu-3789.41.3~3/RELEASE_X86_64 x86_64

Note much I can think of to help.

Regards and thanks for all your efforts Fergus.


You may investigate any problem if you feel able to do so, in which
case the test suite provides a good starting point.  Its output may
be found below `tests/testsuite.dir'.

make[3]: *** [check-local] Error 1
make[2]: *** [check-am] Error 2
make[1]: *** [check-recursive] Error 1
make: *** [check] Error 2
fergus: more tests/testsuite.log
## ----------------------------- ##
## GNU Autoconf 2.69 test suite. ##
## ----------------------------- ##

testsuite: command line was:
  $ ./testsuite

## ---------- ##
## ChangeLog. ##
## ---------- ##

| 2012-04-24  Eric Blake  <[hidden email]>
|
|       Release Version 2.69.
|       * NEWS: Mention the release.
|
| 2012-04-24  Eric Blake  <[hidden email]>
|
|       maint: drop bz2 tarball
|       At 2.68b, I asked whether anyone would miss .gz and .bz2 formats.
|       Consensus was overwhelming that .gz still holds a place in people's

## --------- ##
## Platform. ##
## --------- ##

hostname = macbookpro-3.local
uname -m = x86_64
uname -r = 16.4.0
uname -s = Darwin
uname -v = Darwin Kernel Version 16.4.0: Thu Dec 22 22:53:21 PST 2016; root:xnu-3789.41.3~3/RELEASE_X86_64

/usr/bin/uname -p = i386
/bin/uname -X     = unknown

/bin/arch              = unknown
/usr/bin/arch -k       = unknown
/usr/convex/getsysinfo = unknown
/usr/bin/hostinfo      = Mach kernel version:
         Darwin Kernel Version 16.4.0: Thu Dec 22 22:53:21 PST 2016; root:xnu-3789.41.3~3/RELEASE_X86_64
Kernel configured for up to 4 processors.
2 processors are physically available.
4 processors are logically available.
Processor type: i486 (Intel 80486)
Processors active: 0 1 2 3
Primary memory available: 4.00 gigabytes
Default processor set: 333 tasks, 1117 threads, 4 processors
Load average: 1.33, Mach factor: 2.66
/bin/machine           = unknown
/usr/bin/oslevel       = unknown
/bin/universe          = unknown

PATH: /usr/local/packages/autoconf-2.69/tests
PATH: /usr/local/bin
PATH: /usr/bin
PATH: /bin
PATH: /usr/sbin
PATH: /sbin

testsuite: atconfig:
| # Configurable variable values for building test suites.
| # Generated by ./config.status.
| # Copyright (C) 2012 Free Software Foundation, Inc.
|
| # The test suite will define top_srcdir=/../.. etc.
| at_testdir='tests'
| abs_builddir='/usr/local/packages/autoconf-2.69/tests'
| at_srcdir='.'
| abs_srcdir='/usr/local/packages/autoconf-2.69/tests'
| at_top_srcdir='..'
| abs_top_srcdir='/usr/local/packages/autoconf-2.69'
| at_top_build_prefix='../'
| abs_top_builddir='/usr/local/packages/autoconf-2.69'
|
| # Backward compatibility with Autotest <= 2.59b:
| at_top_builddir=$at_top_build_prefix
|
| AUTOTEST_PATH='tests'
|
| SHELL=${CONFIG_SHELL-'/bin/sh'}

testsuite: atlocal:
| # -*- shell-script -*-
| # tests/atlocal.  Generated from atlocal.in by configure.
| # Configurable variable values for Autoconf test suite.
|
| # Copyright (C) 2000-2001, 2005, 2008-2012 Free Software Foundation,
| # Inc.
| #
| # This program is free software: you can redistribute it and/or modify
| # it under the terms of the GNU General Public License as published by
| # the Free Software Foundation, either version 3 of the License, or
| # (at your option) any later version.
| #
| # This program is distributed in the hope that it will be useful,
| # but WITHOUT ANY WARRANTY; without even the implied warranty of
| # MERCHANTABILITY or FITNESS FOR A PARTICULAR PURPOSE.  See the
| # GNU General Public License for more details.
| #
| # You should have received a copy of the GNU General Public License
| # along with this program.  If not, see <http://www.gnu.org/licenses/>.
|
| PERL='/usr/local/bin/perl'
| GREP='/usr/bin/grep'
| EGREP='/usr/bin/grep -E'
| SED='/usr/bin/sed'
|
| # We need to know if sh -n is ok.
| ac_cv_sh_n_works='yes'
|
| # Check whether the underlying system can manage some unusual
| # symbols in file names.
| if test -z ''; then
|   func_sanitize_file_name () { echo "$@"; }
| else
|   func_sanitize_file_name () { echo "$@" | tr -d ''; }
| fi
|
| # Can we create directories with trailing whitespace in their names?
| ac_cv_dir_trailing_space='yes'
| if test "$ac_cv_dir_trailing_space" = yes; then
|   func_sanitize_dir_name () { echo "$@"; }
| else
|   func_sanitize_dir_name () { echo "$@" | sed 's/  *$//'; }
| fi
|
| # AUTOM4TE might be set in the environment.  Override it here so that
| # direct aclocal invocations also use it.
| AUTOM4TE=autom4te
| export AUTOM4TE

## ---------------- ##
## Tested programs. ##
## ---------------- ##

./local.at:527: /usr/local/packages/autoconf-2.69/tests/autom4te --version
autom4te (GNU Autoconf) 2.69
Copyright (C) 2012 Free Software Foundation, Inc.
License GPLv3+/Autoconf: GNU GPL version 3 or later
<http://gnu.org/licenses/gpl.html>, <http://gnu.org/licenses/exceptions.html>
This is free software: you are free to change and redistribute it.
There is NO WARRANTY, to the extent permitted by law.

Written by Akim Demaille.

./local.at:527: /usr/local/packages/autoconf-2.69/tests/autoconf --version
autoconf (GNU Autoconf) 2.69
Copyright (C) 2012 Free Software Foundation, Inc.
License GPLv3+/Autoconf: GNU GPL version 3 or later
<http://gnu.org/licenses/gpl.html>, <http://gnu.org/licenses/exceptions.html>
This is free software: you are free to change and redistribute it.
There is NO WARRANTY, to the extent permitted by law.

Written by David J. MacKenzie and Akim Demaille.

./local.at:527: /usr/local/packages/autoconf-2.69/tests/autoheader --version
autoheader (GNU Autoconf) 2.69
Copyright (C) 2012 Free Software Foundation, Inc.
License GPLv3+/Autoconf: GNU GPL version 3 or later
<http://gnu.org/licenses/gpl.html>, <http://gnu.org/licenses/exceptions.html>
This is free software: you are free to change and redistribute it.
There is NO WARRANTY, to the extent permitted by law.

Written by Roland McGrath and Akim Demaille.

./local.at:527: /usr/local/packages/autoconf-2.69/tests/autoupdate --version
autoupdate (GNU Autoconf) 2.69
Copyright (C) 2012 Free Software Foundation, Inc.
License GPLv3+/Autoconf: GNU GPL version 3 or later
<http://gnu.org/licenses/gpl.html>, <http://gnu.org/licenses/exceptions.html>
This is free software: you are free to change and redistribute it.
There is NO WARRANTY, to the extent permitted by law.

Written by David J. MacKenzie and Akim Demaille.

./local.at:527: /usr/local/packages/autoconf-2.69/tests/autoreconf --version
autoreconf (GNU Autoconf) 2.69
Copyright (C) 2012 Free Software Foundation, Inc.
License GPLv3+/Autoconf: GNU GPL version 3 or later
<http://gnu.org/licenses/gpl.html>, <http://gnu.org/licenses/exceptions.html>
This is free software: you are free to change and redistribute it.
There is NO WARRANTY, to the extent permitted by law.

Written by David J. MacKenzie and Akim Demaille.

./local.at:527: /usr/local/packages/autoconf-2.69/tests/ifnames --version
ifnames (GNU Autoconf) 2.69
Copyright (C) 2012 Free Software Foundation, Inc.
License GPLv3+/Autoconf: GNU GPL version 3 or later
<http://gnu.org/licenses/gpl.html>, <http://gnu.org/licenses/exceptions.html>
This is free software: you are free to change and redistribute it.
There is NO WARRANTY, to the extent permitted by law.

Written by David J. MacKenzie and Paul Eggert.

## ------------------ ##
## Running the tests. ##
## ------------------ ##
testsuite: starting at: Wed Mar  1 22:11:55 GMT 2017
1. Syntax of the shell scripts (tools.at:46): ok     (0m0.418s 0m0.022s)
2. Syntax of the Perl scripts (tools.at:70): ok     (0m0.440s 0m0.054s)
3. autom4te cache (tools.at:88): ok     (0m0.357s 0m0.103s)
4. autom4te --force (tools.at:119): ok     (0m0.240s 0m0.071s)
5. autom4te and whitespace in file names (tools.at:145): ok     (0m1.289s 0m0.372s)
6. autom4te --trace and unusual macro names (tools.at:217): ok     (0m0.115s 0m0.032s)
7. autom4te --trace and whitespace (tools.at:227): ok     (0m0.117s 0m0.035s)
8. autoconf --trace: user macros (tools.at:252): ok     (0m0.678s 0m0.233s)
9. autoconf --trace: builtins (tools.at:338): ok     (0m0.643s 0m0.125s)
10. autoconf: forbidden tokens, basic (tools.at:369): ok     (0m0.331s 0m0.113s)
11. autoconf: forbidden tokens, exceptions (tools.at:407): ok     (0m0.187s 0m0.064s)
12. autoconf: automatically allowed tokens (tools.at:446): ok     (0m0.261s 0m0.059s)
13. autoconf: the empty token (tools.at:463): ok     (0m0.165s 0m0.057s)
14. autoconf: subdirectories (tools.at:478): ok     (0m0.499s 0m0.262s)
15. autoconf: input from stdin (tools.at:504): ok     (0m0.407s 0m0.119s)
16. autoconf: AC_AUTOCONF_VERSION (tools.at:522): ok     (0m0.250s 0m0.060s)
17. autoconf: AC_PRESERVE_HELP_ORDER (tools.at:540): ok     (0m0.318s 0m0.116s)
18. ifnames (tools.at:577): ok     (0m0.072s 0m0.016s)
19. autoheader (tools.at:625): ok     (0m0.796s 0m0.183s)
20. autoheader and macros (tools.at:758): ok     (0m0.485s 0m0.123s)
21. autoupdate (tools.at:799): ok     (0m2.350s 0m0.221s)
22. autoupdating AC_LINK_FILES (tools.at:831): ok     (0m1.609s 0m0.344s)
23. autoupdating AC_PREREQ (tools.at:858): ok     (0m3.481s 0m0.355s)
24. autoupdating AU_ALIAS (tools.at:879): ok     (0m2.465s 0m0.783s)
25. autoupdating OLD to NEW (tools.at:905): ok     (0m1.496s 0m0.262s)
27. autoupdating AC_HELP_STRING (tools.at:955): ok     (0m1.482s 0m0.263s)
28. autoupdating with m4sugar (tools.at:973): ok     (0m1.774s 0m0.374s)
32. autoupdating AC_LANG_SAVE (tools.at:1088): ok     (0m1.708s 0m0.306s)
33. autoupdating AC_FOREACH (tools.at:1108): ok     (0m1.649s 0m0.292s)
34. autoupdating with aclocal and m4_include (tools.at:1132): skipped (tools.at:1135)
35. autom4te preselections (tools.at:1162): skipped (tools.at:1168)
36. autom4te cache creation (tools.at:1215): ok     (0m0.559s 0m0.169s)
37. autom4te cache locking (tools.at:1258): ok     (0m0.503s 0m0.185s)
38. autotools and whitespace in file names (tools.at:1278): skipped (tools.at:1281)
39. m4_stack (m4sugar.at:41): ok     (0m0.179s 0m0.048s)
40. m4_defn (m4sugar.at:102): ok     (0m0.615s 0m0.189s)
41. m4_dumpdef (m4sugar.at:186): ok     (0m0.537s 0m0.160s)
42. m4_warn (m4sugar.at:245): ok     (0m0.512s 0m0.156s)
43. m4_divert_stack (m4sugar.at:303): ok     (0m0.614s 0m0.173s)
44. m4_expansion_stack (m4sugar.at:392): ok     (0m0.128s 0m0.038s)
45. m4_require: error message (m4sugar.at:416): ok     (0m0.125s 0m0.036s)
46. m4_require: circular dependencies (m4sugar.at:436): ok     (0m0.119s 0m0.034s)
47. m4_require: one-shot initialization (m4sugar.at:466): ok     (0m0.242s 0m0.072s)
48. m4_require: nested (m4sugar.at:527): ok     (0m0.608s 0m0.180s)
49. m4sugar shorthand conditionals (m4sugar.at:695): ok     (0m0.122s 0m0.033s)
50. m4_cond (m4sugar.at:780): ok     (0m0.132s 0m0.043s)
51. m4 lists (m4sugar.at:832): ok     (0m0.242s 0m0.069s)
52. m4_split (m4sugar.at:884): ok     (0m0.126s 0m0.038s)
53. m4_do (m4sugar.at:930): ok     (0m0.126s 0m0.035s)
54. m4_append (m4sugar.at:958): ok     (0m0.267s 0m0.077s)
55. m4_join (m4sugar.at:1042): ok     (0m0.120s 0m0.036s)
56. m4_expand (m4sugar.at:1093): ok     (0m0.126s 0m0.036s)
57. m4_text_box (m4sugar.at:1149): ok     (0m0.118s 0m0.037s)
58. m4_text_wrap (m4sugar.at:1173): ok     (0m0.127s 0m0.039s)
59. m4_version_compare (m4sugar.at:1235): ok     (0m0.129s 0m0.041s)
60. Standard regular expressions (m4sugar.at:1293): ok     (0m0.882s 0m0.250s)
61. m4_bmatch (m4sugar.at:1320): ok     (0m0.133s 0m0.035s)
62. m4_toupper and m4_tolower (m4sugar.at:1352): ok     (0m0.127s 0m0.037s)
63. m4_bpatsubsts (m4sugar.at:1389): ok     (0m0.126s 0m0.037s)
64. m4_esyscmd_s (m4sugar.at:1418): ok     (0m0.127s 0m0.042s)
65. M4 loops (m4sugar.at:1446): ok     (0m0.620s 0m0.177s)
66. m4_map (m4sugar.at:1600): ok     (0m0.127s 0m0.040s)
67. m4_map_args and m4_curry (m4sugar.at:1675): ok     (0m0.368s 0m0.102s)
68. m4_combine (m4sugar.at:1747): ok     (0m0.130s 0m0.037s)
69. m4_max and m4_min (m4sugar.at:1774): ok     (0m0.353s 0m0.100s)
70. recursion (m4sugar.at:1853): ok     (0m2.918s 0m0.092s)
71. m4_set (m4sugar.at:1970): ok     (0m2.341s 0m0.131s)
72. __file__ and __line__ (m4sugar.at:2120): ok     (0m0.132s 0m0.041s)
73. No extra re-exec with CONFIG_SHELL (m4sh.at:24): ok     (0m0.160s 0m0.052s)
74. Forced re-exec with CONFIG_SHELL (m4sh.at:42): ok     (0m0.172s 0m0.067s)
75. Configure re-execs self with CONFIG_SHELL (m4sh.at:110): ok     (0m0.379s 0m0.171s)
76. AS_WARN and AS_ERROR (m4sh.at:145): ok     (0m0.374s 0m0.178s)
77. LINENO (m4sh.at:210): ok     (0m0.665s 0m0.331s)
78. LINENO stack (m4sh.at:287): ok     (0m0.160s 0m0.052s)
79. AS_BOX (m4sh.at:316): ok     (0m0.158s 0m0.052s)
80. AS_BASENAME (m4sh.at:358): ok     (0m0.268s 0m0.162s)
81. AS_DIRNAME (m4sh.at:415): ok     (0m0.293s 0m0.162s)
82. AS_SET_CATFILE (m4sh.at:474): ok     (0m0.148s 0m0.044s)
83. AS_ECHO and AS_ECHO_N (m4sh.at:518): ok     (0m0.156s 0m0.063s)
84. AS_EXECUTABLE_P (m4sh.at:567): ok     (0m0.160s 0m0.054s)
85. AS_EXIT (m4sh.at:619): ok     (0m0.230s 0m0.139s)
86. AS_MKDIR_P (m4sh.at:668): ok     (0m0.168s 0m0.059s)
87. AS_VERSION_COMPARE (m4sh.at:700): ok     (0m0.214s 0m0.090s)
88. as_me (m4sh.at:746): ok     (0m0.151s 0m0.052s)
89. Negated classes in globbing (m4sh.at:770): ok     (0m0.158s 0m0.055s)
90. Null variable substitution (m4sh.at:798): ok     (0m0.149s 0m0.055s)
91. Functions Support (m4sh.at:864): ok     (0m0.162s 0m0.056s)
92. Functions and return Support (m4sh.at:906): ok     (0m0.157s 0m0.055s)
93. Nested AS_REQUIRE_SHELL_FN (m4sh.at:943): ok     (0m0.146s 0m0.045s)
94. Nested AS_REQUIRE (m4sh.at:976): ok     (0m0.149s 0m0.047s)
95. AS_REQUIRE_SHELL_FN and m4_require (m4sh.at:1014): ok     (0m0.151s 0m0.053s)
96. AS_HELP_STRING (m4sh.at:1055): ok     (0m0.165s 0m0.050s)
97. AS_IF and AS_CASE (m4sh.at:1194): ok     (0m0.639s 0m0.138s)
98. AS_FOR (m4sh.at:1351): ok     (0m0.147s 0m0.052s)
99. AS_LITERAL_IF (m4sh.at:1419): ok     (0m0.150s 0m0.052s)
100. AS_TR_SH and AS_TR_CPP (m4sh.at:1497): ok     (0m0.251s 0m0.182s)
101. AS_VAR basics (m4sh.at:1582): ok     (0m0.166s 0m0.063s)
102. AS_VAR_APPEND (m4sh.at:1694): ok     (0m0.142s 0m0.050s)
103. AS_VAR_ARITH (m4sh.at:1729): ok     (0m0.150s 0m0.054s)
104. AS_INIT cleanup (m4sh.at:1760): ok     (0m0.146s 0m0.050s)
105. AS_INIT_GENERATED (m4sh.at:1797): ok     (0m0.548s 0m0.291s)
106. AS_MESSAGE_FD (m4sh.at:1871): ok     (0m0.187s 0m0.088s)
107. _AS_CLEAN_DIR (m4sh.at:1915): ok     (0m0.177s 0m0.074s)
108. ECHO_C (m4sh.at:1944): ok     (0m0.184s 0m0.080s)
109. AT_COPYRIGHT (autotest.at:158): ok     (0m0.281s 0m0.133s)
110. AT_DATA (autotest.at:177): ok     (0m0.466s 0m0.315s)
111. Empty test suite (autotest.at:188): ok     (0m0.388s 0m0.238s)
112. Banner-only test suite (autotest.at:193): ok     (0m0.384s 0m0.228s)
113. Empty test (autotest.at:196): ok     (0m0.426s 0m0.256s)
114. Empty check (autotest.at:199): ok     (0m0.395s 0m0.239s)
115. AT_SETUP without AT_INIT (autotest.at:206): ok     (0m0.117s 0m0.037s)
116. AT_BANNER without AT_INIT (autotest.at:210): ok     (0m0.145s 0m0.052s)
117. AT_CLEANUP without AT_INIT (autotest.at:214): ok     (0m0.122s 0m0.039s)
118. Missing AT_CLEANUP (autotest.at:220): ok     (0m0.144s 0m0.040s)
119. AT_FAIL_IF without AT_SETUP (autotest.at:225): ok     (0m0.155s 0m0.043s)
120. AT_SKIP_IF without AT_SETUP (autotest.at:230): ok     (0m0.163s 0m0.040s)
121. AT_CHECK without AT_SETUP (autotest.at:235): ok     (0m0.144s 0m0.043s)
122. AT_DATA without AT_SETUP (autotest.at:240): ok     (0m0.150s 0m0.040s)
123. AT_XFAIL_IF without AT_SETUP (autotest.at:245): ok     (0m0.145s 0m0.041s)
124. AT_KEYWORDS without AT_SETUP (autotest.at:250): ok     (0m0.147s 0m0.038s)
125. AT_CLEANUP without AT_SETUP (autotest.at:255): ok     (0m0.152s 0m0.039s)
126. AT_BANNER inside AT_SETUP (autotest.at:263): ok     (0m0.152s 0m0.043s)
127. AT_SETUP inside AT_SETUP (autotest.at:273): ok     (0m0.168s 0m0.046s)
128. Multiple AT_INIT (autotest.at:278): ok     (0m0.148s 0m0.041s)
129. Tested programs (autotest.at:289): ok     (0m0.699s 0m0.366s)
130. Startup error messages (autotest.at:297): ok     (0m0.427s 0m0.279s)
131. Truth (autotest.at:304): ok     (0m0.429s 0m0.275s)
132. Fallacy (autotest.at:309): ok     (0m0.541s 0m0.389s)
133. Skip (autotest.at:314): ok     (0m0.425s 0m0.260s)
134. Hard fail (autotest.at:324): ok     (0m0.560s 0m0.394s)
135. AT_FAIL_IF (autotest.at:344): ok     (0m0.641s 0m0.458s)
136. AT_SKIP_IF (autotest.at:364): ok     (0m0.546s 0m0.376s)
137. Syntax error (autotest.at:383): ok     (0m0.653s 0m0.457s)
138. errexit (autotest.at:424): ok     (0m0.931s 0m0.725s)
139. at_status (autotest.at:450): ok     (0m1.053s 0m0.841s)
140. AT_CHECK execution environment (autotest.at:469): ok     (0m0.528s 0m0.330s)
141. unquoted output (autotest.at:477): ok     (0m0.420s 0m0.247s)
142. Trace output (autotest.at:483): ok     (0m0.418s 0m0.271s)
143. Logging (autotest.at:527): ok     (0m1.111s 0m0.916s)
144. Binary output (autotest.at:569): ok     (0m1.023s 0m0.803s)
145. Cleanup (autotest.at:606): ok     (0m1.228s 0m1.045s)
146. Literal multiline command (autotest.at:616): ok     (0m0.412s 0m0.256s)
147. Multiline parameter expansion (autotest.at:623): ok     (0m0.406s 0m0.239s)
148. Backquote command substitution (autotest.at:627): ok     (0m0.404s 0m0.245s)
149. Multiline backquote command substitution (autotest.at:636): ok     (0m0.410s 0m0.250s)
150. Parenthetical command substitution (autotest.at:641): ok     (0m0.412s 0m0.250s)
151. Multiline parenthetical command substitution (autotest.at:650): ok     (0m0.393s 0m0.243s)
152. Shell comment in command (autotest.at:656): ok     (0m0.415s 0m0.249s)
153. Invalid brace-enclosed parameter expansion (autotest.at:668): ok     (0m0.489s 0m0.328s)
154. Multiline command from M4 expansion (autotest.at:680): ok     (0m0.416s 0m0.246s)
155. Double-M4-quoted command (autotest.at:686): ok     (0m0.412s 0m0.251s)
156. Metacharacters in command from M4 expansion (autotest.at:692): ok     (0m0.405s 0m0.248s)
157. BS-newline in command (autotest.at:702): ok     (0m0.402s 0m0.246s)
158. ^BS-newline in command (autotest.at:707): ok     (0m0.394s 0m0.241s)
159. BSx641-newline in command (autotest.at:712): ok     (0m0.411s 0m0.244s)
160. BS-BS-newline in command (autotest.at:718): ok     (0m0.406s 0m0.241s)
161. BSx640-newline in command (autotest.at:726): ok     (0m0.396s 0m0.240s)
162. Newline-CODE-BS-newline in command (autotest.at:734): ok     (0m0.405s 0m0.245s)
163. Single-quote-BS-newline in command (autotest.at:740): ok     (0m0.405s 0m0.244s)
164. Single-quote-newline-BS-newline in command (autotest.at:748): ok     (0m0.425s 0m0.250s)
165. Input from stdin (autotest.at:755): ok     (0m0.445s 0m0.280s)
166. Backquote in a test title (autotest.at:831): ok     (0m0.661s 0m0.478s)
167. Single-quote in a test title (autotest.at:832): ok     (0m0.673s 0m0.487s)
168. Double-quote in a test title (autotest.at:833): ok     (0m0.686s 0m0.493s)
169. Backslash in a test title (autotest.at:835): ok     (0m0.688s 0m0.495s)
170. Brackets in a test title (autotest.at:836): ok     (0m0.668s 0m0.483s)
171. Left bracket in a test title (autotest.at:837): ok     (0m0.675s 0m0.486s)
172. Right bracket in a test title (autotest.at:838): ok     (0m0.709s 0m0.492s)
173. Quoted pound in a test title (autotest.at:839): ok     (0m0.699s 0m0.497s)
174. Pound in a test title (autotest.at:840): ok     (0m0.668s 0m0.489s)
175. Quoted comma in a test title (autotest.at:841): ok     (0m0.678s 0m0.485s)
176. Comma in a test title (autotest.at:842): ok     (0m0.676s 0m0.487s)
177. Parentheses in a test title (autotest.at:844): ok     (0m0.670s 0m0.487s)
178. Left paren in a test title (autotest.at:845): ok     (0m0.676s 0m0.485s)
179. Right paren in a test title (autotest.at:846): ok     (0m0.676s 0m0.491s)
180. Quoted Macro in a test title (autotest.at:848): ok     (0m0.681s 0m0.490s)
181. Macro in a test title (autotest.at:849): ok     (0m0.681s 0m0.491s)
182. Macro with backquote in a test title (autotest.at:850): ok     (0m0.671s 0m0.485s)
183. Macro with single-quote in a test title (autotest.at:851): ok     (0m0.661s 0m0.477s)
184. Macro with double-quote in a test title (autotest.at:852): ok     (0m0.664s 0m0.475s)
185. Macro with backslash in a test title (autotest.at:854): ok     (0m0.678s 0m0.488s)
186. Macro echoing macro in a test title (autotest.at:856): ok     (0m0.668s 0m0.484s)
187. Macro echoing single-quote in a test title (autotest.at:857): ok     (0m0.700s 0m0.498s)
188. Long test title in a test title (autotest.at:858): ok     (0m0.680s 0m0.487s)
189. Longer test title in a test title (autotest.at:860): ok     (0m0.670s 0m0.483s)
190. Long test source lines (autotest.at:875): ok     (0m0.537s 0m0.347s)
191. Huge testsuite (autotest.at:889): ok     (0m1.942s 0m0.611s)
192. Debugging a successful test (autotest.at:908): ok     (0m0.762s 0m0.557s)
193. Debugging script and environment (autotest.at:923): ok     (0m1.034s 0m0.803s)
194. Debugging a failed test (autotest.at:934): ok     (0m0.794s 0m0.587s)
195. Using atlocal (autotest.at:969): ok     (0m1.245s 0m1.001s)
196. Choosing where testsuite is run (autotest.at:1004): ok     (0m1.006s 0m0.785s)
197. recheck (autotest.at:1050): ok     (0m1.566s 0m1.312s)
198. Banners (autotest.at:1056): ok     (0m2.888s 0m2.474s)
199. Keywords and ranges (autotest.at:1123): ok     (0m5.608s 0m4.933s)
200. Keyword wrapping (autotest.at:1226): ok     (0m0.223s 0m0.083s)
201. AT_ARG_OPTION (autotest.at:1297): ok     (0m1.980s 0m1.647s)
202. AT_ARG_OPTION_ARG (autotest.at:1350): ok     (0m1.954s 0m1.618s)
203. parallel test execution (autotest.at:1370): ok     (0m1.903s 0m1.634s)
204. parallel truth (autotest.at:1464): ok     (0m0.422s 0m0.251s)
205. parallel fallacy (autotest.at:1469): ok     (0m0.523s 0m0.346s)
206. parallel skip (autotest.at:1474): ok     (0m0.441s 0m0.262s)
207. parallel syntax error (autotest.at:1493): ok     (0m0.697s 0m0.504s)
208. parallel errexit (autotest.at:1508): ok     (0m0.603s 0m0.448s)
209. parallel autotest and signal handling (autotest.at:1511): ok     (0m2.036s 0m1.756s)
210. parallel args but non-working mkfifo (autotest.at:1648): ok     (0m0.553s 0m0.341s)
211. colored test results (autotest.at:1734): ok     (0m1.897s 0m1.611s)
212. srcdir propagation (autotest.at:1741): ok     (0m2.499s 0m1.918s)
213. whitespace in absolute testdir (autotest.at:1819): ok     (0m0.531s 0m0.351s)
214. unusual file names (autotest.at:1843): ok     (0m0.322s 0m0.156s)
215. Erlang Eunit unit tests (autotest.at:1873): ok     (0m0.865s 0m0.446s)
216. AC_REQUIRE: topological sort (base.at:28): ok     (0m0.190s 0m0.073s)
217. AC_REQUIRE: error message (base.at:72): ok     (0m0.157s 0m0.054s)
218. AC_REQUIRE & AC_DEFUN_ONCE: Require, expand (base.at:90): ok     (0m0.198s 0m0.078s)
219. AC_REQUIRE & AC_DEFUN_ONCE: Expand, require (base.at:132): ok     (0m0.202s 0m0.083s)
220. AC_REQUIRE & AC_PROVIDE (base.at:174): ok     (0m0.202s 0m0.080s)
221. AC_INIT (base.at:207): ok     (0m0.375s 0m0.153s)
222. AC_INIT with unusual version strings (base.at:226): ok     (0m1.406s 0m0.591s)
223. AC_COPYRIGHT (base.at:291): ok     (0m0.330s 0m0.118s)
224. AC_CACHE_CHECK (base.at:322): ok     (0m4.455s 0m2.683s)
225. AC_CACHE_LOAD (base.at:513): ok     (0m0.430s 0m0.206s)
226. AC_COMPUTE_INT (base.at:539): ok     (0m0.837s 0m0.782s)
227. AC_TRY_COMMAND (base.at:561): ok     (0m0.375s 0m0.180s)
228. Input/Output (base.at:591): ok     (0m0.448s 0m0.237s)
229. configure arguments (base.at:609): ok     (0m0.452s 0m0.241s)
230. AC_ARG_ENABLE and AC_ARG_WITH (base.at:631): ok     (0m0.670s 0m0.420s)
231. configure directories (base.at:683): ok     (0m0.552s 0m0.344s)
232. AC_CONFIG_COMMANDS with empty commands (torture.at:28): ok     (0m0.953s 0m0.497s)
233. AC_CONFIG_COMMANDS with temporary directory (torture.at:56): ok     (0m1.043s 0m0.580s)
234. Multiple AC_CONFIG_FILES (torture.at:63): ok     (0m0.191s 0m0.056s)
235. Parameterized AC_CONFIG_FILES (torture.at:75): ok     (0m0.571s 0m0.302s)
236. AC_ARG_VAR (torture.at:129): ok     (0m3.954s 0m3.119s)
237. AC_CONFIG_FILES, HEADERS, LINKS and COMMANDS (torture.at:186): ok     (0m6.083s 0m4.903s)
238. Macro calls in AC_CONFIG_COMMANDS tags (torture.at:377): ok     (0m0.422s 0m0.202s)
239. Missing templates (torture.at:397): ok     (0m0.688s 0m0.412s)
240. configure invocation (torture.at:439): ok     (0m2.582s 0m1.840s)
241. #define header templates (torture.at:503): ok     (0m0.549s 0m0.276s)
242. Torturing config.status (torture.at:637): ok     (0m1.720s 0m0.806s)
243. Substitute a 2000-byte string (torture.at:779): ok     (0m1.015s 0m0.554s)
244. Define to a 2000-byte string (torture.at:857): ok     (0m0.729s 0m0.437s)
245. Substitute and define special characters (torture.at:881): ok     (0m1.149s 0m0.687s)
246. Substitute a newline (torture.at:988): ok     (0m0.756s 0m0.471s)
247. Define a newline (torture.at:1029): ok     (0m1.417s 0m0.591s)
248. AC_SUBST: variable name validation (torture.at:1074): ok     (0m3.472s 0m1.339s)
249. datarootdir workaround (torture.at:1104): ok     (0m0.996s 0m0.508s)
250. srcdir (torture.at:1155): ok     (0m1.005s 0m0.694s)
251. VPATH (torture.at:1198): ok     (0m1.245s 0m0.851s)
252. Signal handling (torture.at:1284): ok     (0m0.354s 0m0.151s)
253. AC_CONFIG_LINKS (torture.at:1302): ok     (0m2.890s 0m2.280s)
254. AC_CONFIG_LINKS and identical files (torture.at:1356): ok     (0m1.784s 0m1.353s)
255. Configuring subdirectories (torture.at:1429): skipped (torture.at:1433)
256. Deep Package (torture.at:1562): skipped (torture.at:1566)
257. Non-Autoconf AC_CONFIG_SUBDIRS (torture.at:1698): skipped (torture.at:1702)
258. Non-literal AC_CONFIG_SUBDIRS (torture.at:1740): ok     (0m2.001s 0m0.804s)
259. Empty directory (torture.at:1791): skipped (torture.at:1795)
260. Unusual Automake input files (torture.at:1812): skipped (torture.at:1816)
261. AC_LANG, AC_LANG_PUSH & AC_LANG_POP (compile.at:31): ok     (0m0.248s 0m0.065s)
262. AC_REQUIRE & AC_LANG (compile.at:83): ok     (0m0.338s 0m0.142s)
263. AC_LANG_SOURCE (compile.at:119): ok     (0m0.804s 0m0.335s)
264. AC_LANG_SOURCE(C++) (compile.at:144): ok     (0m0.780s 0m0.302s)
265. AC_LANG_SOURCE example (compile.at:170): ok     (0m0.341s 0m0.152s)
266. AC_LANG_PROGRAM example (compile.at:215): ok     (0m0.343s 0m0.150s)
267. AC_COMPILE_IFELSE (compile.at:267): ok     (0m2.620s 0m0.965s)
268. AC_RUN_IFELSE (compile.at:310): ok     (0m1.001s 0m0.549s)
269. Order of user actions and cleanup (compile.at:344): ok     (0m1.135s 0m0.491s)
270. AC_TRY_LINK_FUNC (compile.at:394): ok     (0m2.010s 0m0.856s)
271. Multiple languages (compile.at:400): ok     (0m3.425s 0m1.476s)
272. AC_NO_EXECUTABLES (aclang.at:13): ok     (0m0.950s 0m0.487s)
273. AC_REQUIRE_CPP (aclang.at:14): ok     (0m1.805s 0m0.812s)
274. Extensions (c.at:44): ok     (0m1.656s 0m0.728s)
275. Broken/missing compilers (c.at:56): ok     (0m0.433s 0m0.184s)
276. C keywords (c.at:84): ok     (0m1.753s 0m0.830s)
277. AC_PROG_CPP requires AC_PROG_CC (c.at:97): ok     (0m1.829s 0m0.895s)
278. AC_PROG_CPP with warnings (c.at:108): ok     (0m1.319s 0m0.579s)
279. AC_PROG_CPP without warnings (c.at:140): skipped (c.at:144)
280. AC_PROG_CPP via CC (c.at:180): skipped (c.at:184)
281. AC_NO_EXECUTABLES (working linker) (c.at:224): ok     (0m1.777s 0m0.763s)
282. AC_NO_EXECUTABLES (broken linker) (c.at:235): ok     (0m1.241s 0m0.646s)
283. AC_USE_SYSTEM_EXTENSIONS (c.at:242): ok     (0m4.120s 0m1.846s)
284. AC_C_RESTRICT and C++ (c.at:265): ok     (0m1.378s 0m0.587s)
285. AC_OPENMP and C (c.at:328): skipped (c.at:372)
286. AC_OPENMP and C++ (c.at:382): skipped (c.at:415)
287. AC_C_BACKSLASH_A (acc.at:13): ok     (0m1.697s 0m0.742s)
288. AC_C_BIGENDIAN (acc.at:14): ok     (0m2.649s 0m1.347s)
289. AC_C_CHAR_UNSIGNED (acc.at:15): ok     (0m2.595s 0m1.244s)
290. AC_C_FLEXIBLE_ARRAY_MEMBER (acc.at:16): ok     (0m1.682s 0m0.759s)
291. AC_C_INLINE (acc.at:17): ok     (0m1.714s 0m0.742s)
292. AC_C_PROTOTYPES (acc.at:18): ok     (0m1.683s 0m0.722s)
293. AC_C_RESTRICT (acc.at:19): ok     (0m1.666s 0m0.740s)
294. AC_C_STRINGIZE (acc.at:20): ok     (0m1.895s 0m0.876s)
295. AC_C_TYPEOF (acc.at:21): ok     (0m1.701s 0m0.750s)
296. AC_C_VARARRAYS (acc.at:22): ok     (0m1.720s 0m0.770s)
297. AC_OPENMP (acc.at:23): ok     (0m1.878s 0m0.884s)
298. AC_PROG_CC_C89 (acc.at:24): ok     (0m1.683s 0m0.745s)
299. AC_PROG_CC_C99 (acc.at:25): ok     (0m1.708s 0m0.782s)
300. AC_PROG_CC_C_O (acc.at:26): ok     (0m1.762s 0m0.790s)
301. AC_PROG_CC_STDC (acc.at:27): ok     (0m1.708s 0m0.744s)
302. AC_PROG_CPP_WERROR (acc.at:28): ok     (0m1.804s 0m0.809s)
303. AC_PROG_GCC_TRADITIONAL (acc.at:29): ok     (0m1.951s 0m0.910s)
304. AC_LANG_C (acc.at:32): ok     (0m2.573s 0m0.766s)
305. AC_LANG_CPLUSPLUS (acc.at:33): ok     (0m2.582s 0m0.693s)
306. AC_LANG_OBJC (acc.at:34): ok     (0m2.539s 0m0.694s)
307. GNU Fortran 77 (fortran.at:52): skipped (fortran.at:52)
308. GNU Fortran (fortran.at:77): skipped (fortran.at:77)
309. AC_OPENMP and Fortran 77 (fortran.at:84): skipped (fortran.at:114)
310. AC_OPENMP and Fortran (fortran.at:124): skipped (fortran.at:154)
311. AC_F77_DUMMY_MAIN usage (fortran.at:176): skipped (fortran.at:241)
312. AC_FC_DUMMY_MAIN usage (fortran.at:253): skipped (fortran.at:319)
313. AC_F77_MAIN usage (fortran.at:331): skipped (fortran.at:395)
314. AC_FC_MAIN usage (fortran.at:410): skipped (fortran.at:474)
315. AC_F77_FUNC usage (fortran.at:489): skipped (fortran.at:551)
316. AC_FC_FUNC usage (fortran.at:563): skipped (fortran.at:625)
317. AC_FC_SRCEXT usage (fortran.at:636): skipped (fortran.at:710)
318. AC_FC_PP_SRCEXT usage (fortran.at:721): skipped (fortran.at:810)
319. AC_FC_FREEFORM (fortran.at:821): skipped (fortran.at:846)
320. AC_FC_FREEFORM with AC_FC_SRCEXT (fortran.at:858): skipped (fortran.at:884)
321. AC_FC_FIXEDFORM (fortran.at:896): skipped (fortran.at:922)
322. AC_FC_FIXEDFORM with AC_FC_SRCEXT (fortran.at:934): skipped (fortran.at:961)
323. AC_FC_LINE_LENGTH (fortran.at:973): skipped (fortran.at:1025)
324. AC_FC_CHECK_BOUNDS (fortran.at:1041): skipped (fortran.at:1087)
325. AC_FC_MODULE_FLAG (fortran.at:1100): skipped (fortran.at:1155)
326. AC_F77_IMPLICIT_NONE (acfortran.at:13): skipped (acfortran.at:13)
327. AC_F77_MAIN (acfortran.at:14): skipped (acfortran.at:14)
328. AC_F77_WRAPPERS (acfortran.at:15): skipped (acfortran.at:15)
329. AC_FC_CHECK_BOUNDS (acfortran.at:16): skipped (acfortran.at:16)
330. AC_FC_FIXEDFORM (acfortran.at:17): skipped (acfortran.at:17)
331. AC_FC_FREEFORM (acfortran.at:18): skipped (acfortran.at:18)
332. AC_FC_IMPLICIT_NONE (acfortran.at:19): skipped (acfortran.at:19)
333. AC_FC_LINE_LENGTH (acfortran.at:20): skipped (acfortran.at:20)
334. AC_FC_MAIN (acfortran.at:21): skipped (acfortran.at:21)
335. AC_FC_MODULE_EXTENSION (acfortran.at:22): skipped (acfortran.at:22)
336. AC_FC_MODULE_FLAG (acfortran.at:23): skipped (acfortran.at:23)
337. AC_FC_MODULE_OUTPUT_FLAG (acfortran.at:24): skipped (acfortran.at:24)
338. AC_FC_PP_DEFINE (acfortran.at:25): skipped (acfortran.at:25)
339. AC_FC_WRAPPERS (acfortran.at:26): skipped (acfortran.at:26)
340. AC_PROG_F77_C_O (acfortran.at:27): skipped (acfortran.at:27)
341. AC_PROG_FC_C_O (acfortran.at:28): skipped (acfortran.at:28)
342. AC_F77_NAME_MANGLING (acfortran.at:31): ok     (0m2.545s 0m0.679s)
343. AC_LANG_FORTRAN77 (acfortran.at:32): ok     (0m2.572s 0m0.689s)
344. Erlang (erlang.at:45): skipped (erlang.at:45)
345. AC_ERLANG_CHECK_LIB (erlang.at:65): skipped (erlang.at:65)
346. AC_ERLANG_SUBST_ROOT_DIR (erlang.at:82): skipped (erlang.at:82)
347. AC_ERLANG_SUBST_LIB_DIR (erlang.at:99): skipped (erlang.at:99)
348. AC_ERLANG_SUBST_INSTALL_LIB_DIR (erlang.at:107): ok     (0m0.948s 0m0.485s)
349. AC_ERLANG_SUBST_INSTALL_LIB_SUBDIR (erlang.at:121): ok     (0m0.946s 0m0.486s)
350. AC_ERLANG_SUBST_ERTS_VER (erlang.at:134): skipped (erlang.at:134)
351. Go (go.at:33): skipped (go.at:33)
352. AC_LANG_GO (acgo.at:15): ok     (0m2.544s 0m0.701s)
353. AC_CHECK_LIB (semantics.at:72): skipped (semantics.at:72)
354. AC_SEARCH_LIBS (semantics.at:85): ok     (0m1.753s 0m0.771s)
355. AC_SEARCH_LIBS (none needed) (semantics.at:99): ok     (0m1.768s 0m0.765s)
356. AC_CHECK_DECLS (semantics.at:152): ok     (0m2.097s 0m1.045s)
357. AC_CHECK_FUNCS (semantics.at:164): ok     (0m1.909s 0m0.823s)
358. AC_REPLACE_FUNCS (semantics.at:172): ok     (0m1.661s 0m0.712s)
359. AC_CHECK_HEADERS (semantics.at:213): ok     (0m2.149s 0m1.010s)
360. AC_CHECK_HEADERS (preprocessor test) (semantics.at:242): ok     (0m1.237s 0m0.517s)
361. AC_CHECK_HEADERS (compiler test) (semantics.at:269): ok     (0m1.242s 0m0.505s)
362. AC_CHECK_MEMBER (semantics.at:322): ok     (0m1.789s 0m0.817s)
363. AC_CHECK_MEMBERS (semantics.at:338): ok     (0m1.819s 0m0.818s)
364. AC_CHECK_ALIGNOF (semantics.at:355): ok     (0m2.777s 0m1.298s)
365. AC_CHECK_ALIGNOF (cross compile) (semantics.at:355): ok     (0m2.603s 0m1.317s)
366. AC_CHECK_ALIGNOF struct (semantics.at:368): ok     (0m2.699s 0m1.285s)
367. AC_CHECK_ALIGNOF struct (cross compile) (semantics.at:368): ok     (0m2.513s 0m1.265s)
368. AC_CHECK_SIZEOF (semantics.at:383): ok     (0m2.868s 0m1.321s)
369. AC_CHECK_SIZEOF (cross compile) (semantics.at:383): ok     (0m2.697s 0m1.352s)
370. AC_CHECK_SIZEOF struct (semantics.at:404): ok     (0m3.089s 0m1.503s)
371. AC_CHECK_SIZEOF struct (cross compile) (semantics.at:404): ok     (0m3.262s 0m1.701s)
372. AC_CHECK_TYPES (semantics.at:420): ok     (0m1.832s 0m0.989s)
373. AC_CHECK_TYPES: backward compatibility (semantics.at:427): ok     (0m0.271s 0m0.069s)
374. AC_CHECK_FILES (semantics.at:472): ok     (0m0.986s 0m0.517s)
375. AC_CHECK_PROG & AC_CHECK_PROGS (semantics.at:506): ok     (0m0.374s 0m0.164s)
376. AC_C_BIGENDIAN (semantics.at:555): ok     (0m4.201s 0m1.854s)
377. AC_PATH_PROG & AC_PATH_PROGS (semantics.at:604): ok     (0m0.362s 0m0.160s)
378. AC_PATH_PROGS_FEATURE_CHECK (semantics.at:646): ok     (0m0.379s 0m0.173s)
379. AC_PATH_XTRA (semantics.at:726): ok     (0m2.001s 0m0.928s)
380. AC_SYS_RESTARTABLE_SYSCALLS (semantics.at:744): ok     (0m2.745s 0m1.341s)
381. AC_FUNC_SETVBUF_REVERSED (semantics.at:745): ok     (0m0.928s 0m0.479s)
382. AC_FUNC_WAIT3 (semantics.at:746): ok     (0m2.713s 0m1.279s)
383. AC_ARG_ENABLE (acgeneral.at:13): ok     (0m0.933s 0m0.480s)
384. AC_ARG_PROGRAM (acgeneral.at:14): ok     (0m0.929s 0m0.484s)
385. AC_ARG_WITH (acgeneral.at:15): ok     (0m0.955s 0m0.495s)
386. AC_CHECK_DECLS_ONCE (acgeneral.at:16): ok     (0m2.625s 0m1.276s)
387. AC_EGREP_CPP (acgeneral.at:17): ok     (0m1.907s 0m0.890s)
388. AC_EGREP_HEADER (acgeneral.at:18): ok     (0m1.949s 0m0.903s)
389. AC_LIBOBJ (acgeneral.at:19): ok     (0m0.933s 0m0.487s)
390. AC_LIBSOURCES (acgeneral.at:20): ok     (0m0.951s 0m0.489s)
391. AC_PREFIX_DEFAULT (acgeneral.at:21): ok     (0m0.926s 0m0.488s)
392. AC_CHECKING (acgeneral.at:24): ok     (0m2.636s 0m0.728s)
393. AC_COMPILE_CHECK (acgeneral.at:25): ok     (0m3.560s 0m1.061s)
394. AC_ENABLE (acgeneral.at:26): ok     (0m2.545s 0m0.701s)
395. AC_FOREACH (acgeneral.at:27): ok     (0m2.595s 0m0.720s)
396. AC_MSG_RESULT_UNQUOTED (acgeneral.at:28): ok     (0m2.712s 0m0.779s)
397. AC_TRY_COMPILE (acgeneral.at:29): ok     (0m3.604s 0m1.228s)
398. AC_TRY_CPP (acgeneral.at:30): ok     (0m3.682s 0m1.381s)
399. AC_TRY_LINK (acgeneral.at:31): ok     (0m3.628s 0m1.222s)
400. AC_TRY_RUN (acgeneral.at:32): ok     (0m3.609s 0m1.093s)
401. AC_VALIDATE_CACHED_SYSTEM_TUPLE (acgeneral.at:33): ok     (0m2.539s 0m0.699s)
402. AC_WITH (acgeneral.at:34): ok     (0m2.594s 0m0.710s)
403. AC_OUTPUT_COMMANDS (acstatus.at:15): ok     (0m2.536s 0m0.698s)
404. AC_SYS_INTERPRETER (acspecific.at:13): ok     (0m0.950s 0m0.498s)
405. AC_SYS_LARGEFILE (acspecific.at:14): ok     (0m1.745s 0m0.782s)
406. AC_SYS_LONG_FILE_NAMES (acspecific.at:15): ok     (0m1.007s 0m0.557s)
407. AC_SYS_POSIX_TERMIOS (acspecific.at:16): ok     (0m1.858s 0m0.879s)
408. AC_AIX (acspecific.at:19): ok     (0m5.250s 0m1.974s)
409. AC_ARG_ARRAY (acspecific.at:20): ok     (0m2.566s 0m0.715s)
410. AC_DECL_SYS_SIGLIST (acspecific.at:21): ok     (0m3.530s 0m1.034s)
411. AC_DYNIX_SEQ (acspecific.at:22): ok     (0m3.749s 0m1.166s)
412. AC_HAVE_POUNDBANG (acspecific.at:23): ok     (0m2.503s 0m0.687s)
413. AC_IRIX_SUN (acspecific.at:24): ok     (0m3.813s 0m1.201s)
414. AC_ISC_POSIX (acspecific.at:25): ok     (0m3.685s 0m1.104s)
415. AC_MINIX (acspecific.at:26): ok     (0m5.248s 0m1.933s)
416. AC_SCO_INTL (acspecific.at:27): ok     (0m3.667s 0m1.047s)
417. AC_XENIX_DIR (acspecific.at:28): ok     (0m4.034s 0m1.354s)
418. AC_PROG_AWK (acprograms.at:13): ok     (0m0.944s 0m0.479s)
419. AC_PROG_FGREP (acprograms.at:14): ok     (0m1.043s 0m0.548s)
420. AC_PROG_INSTALL (acprograms.at:15): ok     (0m0.953s 0m0.503s)
421. AC_PROG_LEX (acprograms.at:16): ok     (0m4.074s 0m3.015s)
422. AC_PROG_LN_S (acprograms.at:17): ok     (0m0.984s 0m0.539s)
423. AC_PROG_MAKE_SET (acprograms.at:18): ok     (0m0.964s 0m0.504s)
424. AC_PROG_MKDIR_P (acprograms.at:19): ok     (0m0.948s 0m0.487s)
425. AC_PROG_RANLIB (acprograms.at:20): ok     (0m0.972s 0m0.498s)
426. AC_PROG_SED (acprograms.at:21): ok     (0m1.046s 0m0.562s)
427. AC_PROG_YACC (acprograms.at:22): ok     (0m0.960s 0m0.486s)
428. AC_CHECK_TOOL_PREFIX (acprograms.at:25): ok     (0m2.552s 0m0.691s)
429. AC_DECL_YYTEXT (acprograms.at:26): ok     (0m5.648s 0m1.350s)
430. AC_RSH (acprograms.at:27): ok     (0m2.559s 0m0.704s)
431. AC_CHECK_HEADERS_ONCE (acheaders.at:13): ok     (0m0.962s 0m0.493s)
432. AC_CHECK_HEADER_STDBOOL (acheaders.at:14): ok     (0m2.673s 0m1.304s)
433. AC_HEADER_ASSERT (acheaders.at:15): ok     (0m0.944s 0m0.489s)
434. AC_HEADER_MAJOR (acheaders.at:16): ok     (0m2.676s 0m1.259s)
435. AC_HEADER_RESOLV (acheaders.at:17): ok     (0m1.907s 0m0.887s)
436. AC_HEADER_STAT (acheaders.at:18): ok     (0m1.684s 0m0.735s)
437. AC_HEADER_STDBOOL (acheaders.at:19): ok     (0m2.673s 0m1.269s)
438. AC_HEADER_TIOCGWINSZ (acheaders.at:20): ok     (0m1.914s 0m0.910s)
439. AC_DIR_HEADER (acheaders.at:23): ok     (0m5.995s 0m2.546s)
440. AC_MEMORY_H (acheaders.at:24): ok     (0m5.281s 0m2.069s)
441. AC_UNISTD_H (acheaders.at:25): ok     (0m5.022s 0m1.826s)
442. AC_USG (acheaders.at:26): ok     (0m5.205s 0m2.037s)
443. AC_STRUCT_DIRENT_D_INO (actypes.at:13): ok     (0m1.873s 0m0.806s)
444. AC_STRUCT_DIRENT_D_TYPE (actypes.at:14): ok     (0m1.836s 0m0.789s)
445. AC_STRUCT_ST_BLOCKS (actypes.at:15): ok     (0m2.594s 0m1.243s)
446. AC_STRUCT_TIMEZONE (actypes.at:16): ok     (0m1.754s 0m0.803s)
447. AC_TYPE_INT16_T (actypes.at:17): ok     (0m2.645s 0m1.309s)
448. AC_TYPE_INT32_T (actypes.at:18): ok     (0m2.589s 0m1.260s)
449. AC_TYPE_INT64_T (actypes.at:19): ok     (0m2.620s 0m1.258s)
450. AC_TYPE_INT8_T (actypes.at:20): ok     (0m2.660s 0m1.333s)
451. AC_TYPE_INTMAX_T (actypes.at:21): ok     (0m2.818s 0m1.367s)
452. AC_TYPE_INTPTR_T (actypes.at:22): ok     (0m2.698s 0m1.307s)
453. AC_TYPE_LONG_DOUBLE (actypes.at:23): ok     (0m1.642s 0m0.728s)
454. AC_TYPE_LONG_DOUBLE_WIDER (actypes.at:24): ok     (0m1.689s 0m0.753s)
455. AC_TYPE_MODE_T (actypes.at:25): ok     (0m2.663s 0m1.265s)
456. AC_TYPE_OFF_T (actypes.at:26): ok     (0m2.760s 0m1.413s)
457. AC_TYPE_SSIZE_T (actypes.at:27): ok     (0m2.622s 0m1.282s)
458. AC_TYPE_UINT16_T (actypes.at:28): ok     (0m2.637s 0m1.271s)
459. AC_TYPE_UINT32_T (actypes.at:29): ok     (0m2.593s 0m1.239s)
460. AC_TYPE_UINT64_T (actypes.at:30): ok     (0m2.618s 0m1.286s)
461. AC_TYPE_UINT8_T (actypes.at:31): ok     (0m2.621s 0m1.263s)
462. AC_TYPE_UINTMAX_T (actypes.at:32): ok     (0m2.794s 0m1.355s)
463. AC_TYPE_UINTPTR_T (actypes.at:33): ok     (0m2.703s 0m1.293s)
464. AC_C_LONG_DOUBLE (actypes.at:36): ok     (0m3.487s 0m1.021s)
465. AC_INT_16_BITS (actypes.at:37): ok     (0m5.168s 0m1.890s)
466. AC_LONG_64_BITS (actypes.at:38): ok     (0m5.217s 0m1.896s)
467. AC_STRUCT_ST_BLKSIZE (actypes.at:39): ok     (0m5.061s 0m1.857s)
468. AC_STRUCT_ST_RDEV (actypes.at:40): ok     (0m5.071s 0m1.833s)
469. AC_TYPE_SIGNAL (actypes.at:41): ok     (0m3.517s 0m1.028s)
470. AM_TYPE_PTRDIFF_T (actypes.at:42): ok     (0m5.219s 0m1.893s)
471. AC_CHECK_FUNCS_ONCE (acfunctions.at:13): ok     (0m0.943s 0m0.488s)
472. AC_FUNC_CHOWN (acfunctions.at:14): ok     (0m2.711s 0m1.305s)
473. AC_FUNC_CLOSEDIR_VOID (acfunctions.at:15): ok     (0m2.810s 0m1.313s)
474. AC_FUNC_ERROR_AT_LINE (acfunctions.at:16): ok     (0m1.708s 0m0.758s)
475. AC_FUNC_FNMATCH (acfunctions.at:17): ok     (0m1.764s 0m0.764s)
476. AC_FUNC_FORK (acfunctions.at:18): ok     (0m3.093s 0m1.475s)
477. AC_FUNC_FSEEKO (acfunctions.at:19): ok     (0m1.786s 0m0.809s)
478. AC_FUNC_GETGROUPS (acfunctions.at:20): ok     (0m2.967s 0m1.383s)
479. AC_FUNC_GETMNTENT (acfunctions.at:21): ok     (0m1.883s 0m1.301s)
480. AC_FUNC_GETPGRP (acfunctions.at:22): ok     (0m2.651s 0m1.928s)
481. AC_FUNC_LSTAT (acfunctions.at:23): ok     (0m2.825s 0m2.049s)
482. AC_FUNC_MALLOC (acfunctions.at:24): ok     (0m2.725s 0m2.252s)
483. AC_FUNC_MBRTOWC (acfunctions.at:25): ok     (0m1.860s 0m1.414s)
484. AC_FUNC_MEMCMP (acfunctions.at:26): ok     (0m2.760s 0m2.234s)
485. AC_FUNC_MKTIME (acfunctions.at:27): ok     (0m2.991s 0m2.110s)
486. AC_FUNC_MMAP (acfunctions.at:28): ok     (0m2.951s 0m2.437s)
487. AC_FUNC_OBSTACK (acfunctions.at:29): ok     (0m2.646s 0m1.806s)
488. AC_FUNC_REALLOC (acfunctions.at:30): ok     (0m2.715s 0m2.233s)
489. AC_FUNC_SELECT_ARGTYPES (acfunctions.at:31): ok     (0m2.832s 0m2.408s)
490. AC_FUNC_SETPGRP (acfunctions.at:32): ok     (0m2.667s 0m1.991s)
491. AC_FUNC_STAT (acfunctions.at:33): ok     (0m2.802s 0m2.054s)
492. AC_FUNC_STRCOLL (acfunctions.at:34): ok     (0m2.707s 0m1.933s)
493. AC_FUNC_STRERROR_R (acfunctions.at:35): ok     (0m2.810s 0m2.110s)
494. AC_FUNC_STRFTIME (acfunctions.at:36): ok     (0m1.818s 0m1.411s)
495. AC_FUNC_STRNLEN (acfunctions.at:37): ok     (0m2.924s 0m2.156s)
496. AC_FUNC_STRTOD (acfunctions.at:38): ok     (0m2.759s 0m2.246s)
497. AC_FUNC_STRTOLD (acfunctions.at:39): ok     (0m1.698s 0m1.365s)
498. AC_FUNC_UTIME_NULL (acfunctions.at:40): ok     (0m2.790s 0m2.007s)
499. AC_FUNC_VPRINTF (acfunctions.at:41): ok     (0m1.876s 0m1.482s)
500. AC_HAVE_LIBRARY (aclibs.at:15): ok     (0m3.568s 0m1.717s)
501. Libtool (foreign.at:25): skipped (foreign.at:29)
502. shtool (foreign.at:92): ok     (0m0.818s 0m0.764s)
testsuite: ending at: Wed Mar  1 22:33:42 GMT 2017
testsuite: test suite duration: 0h 21m 47s

## ------------- ##
## Test results. ##
## ------------- ##

ERROR: 448 tests were run,
5 failed (4 expected failures).
55 tests were skipped.

## ------------------------ ##
## Summary of the failures. ##
## ------------------------ ##
Failed tests:
GNU Autoconf 2.69 test suite test groups:

 NUM: FILE-NAME:LINE     TEST-GROUP-NAME
      KEYWORDS

 503: autoscan.at:20     autoscan

Skipped tests:
GNU Autoconf 2.69 test suite test groups:

 NUM: FILE-NAME:LINE     TEST-GROUP-NAME
      KEYWORDS

  34: tools.at:1132      autoupdating with aclocal and m4_include
  35: tools.at:1162      autom4te preselections
  38: tools.at:1278      autotools and whitespace in file names
 255: torture.at:1429    Configuring subdirectories
      autoreconf
 256: torture.at:1562    Deep Package
      autoreconf
 257: torture.at:1698    Non-Autoconf AC_CONFIG_SUBDIRS
      autoreconf
 259: torture.at:1791    Empty directory
      autoreconf
 260: torture.at:1812    Unusual Automake input files
      autoreconf
 279: c.at:140           AC_PROG_CPP without warnings
 280: c.at:180           AC_PROG_CPP via CC
 285: c.at:328           AC_OPENMP and C
 286: c.at:382           AC_OPENMP and C++
 307: fortran.at:52      GNU Fortran 77
 308: fortran.at:77      GNU Fortran
 309: fortran.at:84      AC_OPENMP and Fortran 77
 310: fortran.at:124     AC_OPENMP and Fortran
 311: fortran.at:176     AC_F77_DUMMY_MAIN usage
 312: fortran.at:253     AC_FC_DUMMY_MAIN usage
 313: fortran.at:331     AC_F77_MAIN usage
 314: fortran.at:410     AC_FC_MAIN usage
 315: fortran.at:489     AC_F77_FUNC usage
 316: fortran.at:563     AC_FC_FUNC usage
 317: fortran.at:636     AC_FC_SRCEXT usage
 318: fortran.at:721     AC_FC_PP_SRCEXT usage
 319: fortran.at:821     AC_FC_FREEFORM
 320: fortran.at:858     AC_FC_FREEFORM with AC_FC_SRCEXT
 321: fortran.at:896     AC_FC_FIXEDFORM
 322: fortran.at:934     AC_FC_FIXEDFORM with AC_FC_SRCEXT
 323: fortran.at:973     AC_FC_LINE_LENGTH
 324: fortran.at:1041    AC_FC_CHECK_BOUNDS
 325: fortran.at:1100    AC_FC_MODULE_FLAG
 326: acfortran.at:13    AC_F77_IMPLICIT_NONE
 327: acfortran.at:14    AC_F77_MAIN
 328: acfortran.at:15    AC_F77_WRAPPERS
 329: acfortran.at:16    AC_FC_CHECK_BOUNDS
 330: acfortran.at:17    AC_FC_FIXEDFORM
 331: acfortran.at:18    AC_FC_FREEFORM
 332: acfortran.at:19    AC_FC_IMPLICIT_NONE
 333: acfortran.at:20    AC_FC_LINE_LENGTH
 334: acfortran.at:21    AC_FC_MAIN
 335: acfortran.at:22    AC_FC_MODULE_EXTENSION
 336: acfortran.at:23    AC_FC_MODULE_FLAG
 337: acfortran.at:24    AC_FC_MODULE_OUTPUT_FLAG
 338: acfortran.at:25    AC_FC_PP_DEFINE
 339: acfortran.at:26    AC_FC_WRAPPERS
 340: acfortran.at:27    AC_PROG_F77_C_O
 341: acfortran.at:28    AC_PROG_FC_C_O
 344: erlang.at:45       Erlang
      erlang
 345: erlang.at:65       AC_ERLANG_CHECK_LIB
      erlang
 346: erlang.at:82       AC_ERLANG_SUBST_ROOT_DIR
      erlang
 347: erlang.at:99       AC_ERLANG_SUBST_LIB_DIR
      erlang
 350: erlang.at:134      AC_ERLANG_SUBST_ERTS_VER
      erlang
 351: go.at:33           Go
 353: semantics.at:72    AC_CHECK_LIB
 501: foreign.at:25      Libtool

## ---------------------- ##
## Detailed failed tests. ##
## ---------------------- ##

#                             -*- compilation -*-
503. autoscan.at:20: testing autoscan ...
./autoscan.at:44: autoscan
--- /dev/null   2017-03-01 22:33:41.000000000 +0000
+++ /usr/local/packages/autoconf-2.69/tests/testsuite.dir/at-groups/503/stderr  2017-03-01 22:33:41.000000000 +0000
@@ -0,0 +1 @@
+Unescaped left brace in regex is deprecated, passed through in regex; marked by <-- HERE in m/\${ <-- HERE [^\}]*}/ at /usr/local/packages/autoconf-2.69/bin/autoscan line 361.
503. autoscan.at:20: 503. autoscan (autoscan.at:20): FAILED (autoscan.at:44)


## ------------- ##
## ../config.log ##
## ------------- ##
| This file contains any messages produced by compilers while
| running configure, to aid debugging if configure makes a mistake.
|
| It was created by GNU Autoconf configure 2.69, which was
| generated by GNU Autoconf 2.69.  Invocation command line was
|
|   $ ./configure
|
| ## --------- ##
| ## Platform. ##
| ## --------- ##
|
| hostname = macbookpro-3.local
| uname -m = x86_64
| uname -r = 16.4.0
| uname -s = Darwin
| uname -v = Darwin Kernel Version 16.4.0: Thu Dec 22 22:53:21 PST 2016; root:xnu-3789.41.3~3/RELEASE_X86_64
|
| /usr/bin/uname -p = i386
| /bin/uname -X     = unknown
|
| /bin/arch              = unknown
| /usr/bin/arch -k       = unknown
| /usr/convex/getsysinfo = unknown
| /usr/bin/hostinfo      = Mach kernel version:
|        Darwin Kernel Version 16.4.0: Thu Dec 22 22:53:21 PST 2016; root:xnu-3789.41.3~3/RELEASE_X86_64
| Kernel configured for up to 4 processors.
| 2 processors are physically available.
| 4 processors are logically available.
| Processor type: i486 (Intel 80486)
| Processors active: 0 1 2 3
| Primary memory available: 4.00 gigabytes
| Default processor set: 327 tasks, 1097 threads, 4 processors
| Load average: 1.25, Mach factor: 2.74
| /bin/machine           = unknown
| /usr/bin/oslevel       = unknown
| /bin/universe          = unknown
|
| PATH: /usr/local/bin
| PATH: /usr/bin
| PATH: /bin
| PATH: /usr/sbin
| PATH: /sbin
|
|
| ## ----------- ##
| ## Core tests. ##
| ## ----------- ##
|
| configure:1796: checking for a BSD-compatible install
| configure:1864: result: /usr/bin/install -c
| configure:1875: checking whether build environment is sane
| configure:1925: result: yes
| configure:2066: checking for a thread-safe mkdir -p
| configure:2105: result: build-aux/install-sh -c -d
| configure:2118: checking for gawk
| configure:2148: result: no
| configure:2118: checking for mawk
| configure:2148: result: no
| configure:2118: checking for nawk
| configure:2148: result: no
| configure:2118: checking for awk
| configure:2134: found /usr/bin/awk
| configure:2145: result: awk
| configure:2156: checking whether make sets $(MAKE)
| configure:2178: result: yes
| configure:2263: checking build system type
| configure:2277: result: x86_64-apple-darwin16.4.0
| configure:2297: checking host system type
| configure:2310: result: x86_64-apple-darwin16.4.0
| configure:2337: autobuild project... GNU Autoconf
| configure:2343: autobuild revision... 2.69
| configure:2348: autobuild hostname... macbookpro-3.local
| configure:2359: autobuild timestamp... 20170301T221134Z
| configure:2387: checking whether /bin/sh -n is known to work
| configure:2406: result: yes
| configure:2410: checking for characters that cannot appear in file names
| configure:2430: result: none
| configure:2436: checking whether directories can have trailing spaces
| configure:2450: result: yes
| configure:2461: checking for expr
| configure:2479: found /bin/expr
| configure:2491: result: /bin/expr
| configure:2510: checking for GNU M4 that supports accurate traces
| configure:2559: result: /usr/bin/m4
| configure:2562: checking whether /usr/bin/m4 accepts --gnu
| configure:2572: result: no
| configure:2583: WARNING: the version of M4 that was found does not support -g
| configure:2585: WARNING: using it with POSIXLY_CORRECT set may cause problems
| configure:2589: checking how m4 supports trace files
| configure:2599: result: --error-output
| configure:2623: checking for perl
| configure:2641: found /usr/local/bin/perl
| configure:2654: result: /usr/local/bin/perl
| configure:2673: checking whether /usr/local/bin/perl Fcntl::flock is implemented
| configure:2687: result: yes
| configure:2705: checking for emacs
| configure:2721: found /usr/bin/emacs
| configure:2732: result: emacs
| configure:2750: checking whether emacs is sufficiently recent
| configure:2760: $TEST_EMACS -batch -q -f batch-byte-compile conftest.el 1>&2
|
| In broken-mode:
| conftest.el:2:35:Warning: assignment to free variable `broken-defaults'
| Wrote /usr/local/packages/autoconf-2.69/conftest.elc
| configure:2763: $? = 0
| configure:2771: result: yes
| configure:2788: checking for emacs
| configure:2815: result: emacs
| configure:2839: checking where .elc files should go
| configure:2852: $EMACS -batch -q -eval '(while load-path (princ (concat (car load-path) "\n")) (setq load-path (cdr load-path)))' </dev/null >conftest.out
| configure:2855: $? = 0
| configure:2868: result: ${datarootdir}/emacs/site-lisp
| configure:2881: checking for grep that handles long lines and -e
| configure:2939: result: /usr/bin/grep
| configure:2944: checking for egrep
| configure:3006: result: /usr/bin/grep -E
| configure:3011: checking for a sed that does not truncate output
| configure:3075: result: /usr/bin/sed
| configure:3085: checking whether make is case sensitive
| configure:3100: result: yes
| configure:3279: creating ./config.status
|
| ## ---------------------- ##
| ## Running config.status. ##
| ## ---------------------- ##
|
| This file was extended by GNU Autoconf config.status 2.69, which was
| generated by GNU Autoconf 2.69.  Invocation command line was
|
|   CONFIG_FILES    =
|   CONFIG_HEADERS  =
|   CONFIG_LINKS    =
|   CONFIG_COMMANDS =
|   $ ./config.status
|
| on macbookpro-3.local
|
| config.status:797: creating tests/Makefile
| config.status:797: creating tests/atlocal
| config.status:797: creating man/Makefile
| config.status:797: creating lib/emacs/Makefile
| config.status:797: creating Makefile
| config.status:797: creating doc/Makefile
| config.status:797: creating lib/Makefile
| config.status:797: creating lib/Autom4te/Makefile
| config.status:797: creating lib/autoscan/Makefile
| config.status:797: creating lib/m4sugar/Makefile
| config.status:797: creating lib/autoconf/Makefile
| config.status:797: creating lib/autotest/Makefile
| config.status:797: creating bin/Makefile
| config.status:1000: executing tests/atconfig commands
|
| ## ---------------- ##
| ## Cache variables. ##
| ## ---------------- ##
|
| ac_cv_build=x86_64-apple-darwin16.4.0
| ac_cv_dir_trailing_space=yes
| ac_cv_env_EMACSLOADPATH_set=
| ac_cv_env_EMACSLOADPATH_value=
| ac_cv_env_EMACS_set=
| ac_cv_env_EMACS_value=
| ac_cv_env_M4_set=
| ac_cv_env_M4_value=
| ac_cv_env_build_alias_set=
| ac_cv_env_build_alias_value=
| ac_cv_env_host_alias_set=
| ac_cv_env_host_alias_value=
| ac_cv_env_target_alias_set=
| ac_cv_env_target_alias_value=
| ac_cv_host=x86_64-apple-darwin16.4.0
| ac_cv_path_EGREP='/usr/bin/grep -E'
| ac_cv_path_EXPR=/bin/expr
| ac_cv_path_GREP=/usr/bin/grep
| ac_cv_path_M4=/usr/bin/m4
| ac_cv_path_PERL=/usr/local/bin/perl
| ac_cv_path_SED=/usr/bin/sed
| ac_cv_path_install='/usr/bin/install -c'
| ac_cv_perl_flock_implemented=yes
| ac_cv_prog_AWK=awk
| ac_cv_prog_EMACS=emacs
| ac_cv_prog_TEST_EMACS=emacs
| ac_cv_prog_emacs_ok=yes
| ac_cv_prog_gnu_m4_debugfile=--error-output
| ac_cv_prog_gnu_m4_gnu=no
| ac_cv_prog_make_make_case=yes
| ac_cv_prog_make_make_set=yes
| ac_cv_sh_n_works=yes
| ac_cv_unsupported_fs_chars=
| am_cv_lispdir='${datarootdir}/emacs/site-lisp'
|
| ## ----------------- ##
| ## Output variables. ##
| ## ----------------- ##
|
| ACLOCAL='${SHELL} /usr/local/packages/autoconf-2.69/build-aux/missing --run aclocal-1.11'
| AMTAR='${SHELL} /usr/local/packages/autoconf-2.69/build-aux/missing --run tar'
| AUTOCONF='${SHELL} /usr/local/packages/autoconf-2.69/build-aux/missing --run autoconf'
| AUTOHEADER='${SHELL} /usr/local/packages/autoconf-2.69/build-aux/missing --run autoheader'
| AUTOMAKE='${SHELL} /usr/local/packages/autoconf-2.69/build-aux/missing --run automake-1.11'
| AWK='awk'
| CYGPATH_W='echo'
| DEFS='-DPACKAGE_NAME=\"GNU\ Autoconf\" -DPACKAGE_TARNAME=\"autoconf\" -DPACKAGE_VERSION=\"2.69\" -DPACKAGE_STRING=\"GNU\ Autoconf\ 2.69\" -DPACKAGE_BUGREPORT=\"[hidden email]\" -DPACKAGE_URL=\"http://www.gnu.org/software/autoconf/\" -DPACKAGE=\"autoconf\" -DVERSION=\"2.69\"'
| ECHO_C='\c'
| ECHO_N=''
| ECHO_T=''
| EGREP='/usr/bin/grep -E'
| EMACS='emacs'
| EMACSLOADPATH=''
| EXPR='/bin/expr'
| GREP='/usr/bin/grep'
| HELP2MAN='${SHELL} /usr/local/packages/autoconf-2.69/build-aux/missing --run help2man'
| INSTALL_DATA='${INSTALL} -m 644'
| INSTALL_PROGRAM='${INSTALL}'
| INSTALL_SCRIPT='${INSTALL}'
| INSTALL_STRIP_PROGRAM='$(install_sh) -c -s'
| LIBOBJS=''
| LIBS=''
| datadir='${datarootdir}'
| datarootdir='${prefix}/share'
| docdir='${datarootdir}/doc/${PACKAGE_TARNAME}'
| dvidir='${docdir}'
| exec_prefix='${prefix}'
| host='x86_64-apple-darwin16.4.0'
| host_alias=''
| host_cpu='x86_64'
| host_os='darwin16.4.0'
| host_vendor='apple'
| htmldir='${docdir}'
| includedir='${prefix}/include'
| infodir='${datarootdir}/info'
| install_sh='${SHELL} /usr/local/packages/autoconf-2.69/build-aux/install-sh'
| libdir='${exec_prefix}/lib'
| libexecdir='${exec_prefix}/libexec'
| lispdir='${datarootdir}/emacs/site-lisp'
| localedir='${datarootdir}/locale'
| localstatedir='${prefix}/var'
| mandir='${datarootdir}/man'
| mkdir_p='$(top_builddir)/build-aux/install-sh -c -d'
| oldincludedir='/usr/include'
| pdfdir='${docdir}'
| prefix='/usr/local'
| program_transform_name='s,x,x,'
| psdir='${docdir}'
| sbindir='${exec_prefix}/sbin'
| sharedstatedir='${prefix}/com'
| sysconfdir='${prefix}/etc'
| target_alias=''
|
| ## ----------- ##
| ## confdefs.h. ##
| ## ----------- ##
|
| /* confdefs.h */
| #define PACKAGE_NAME "GNU Autoconf"
| #define PACKAGE_TARNAME "autoconf"
| #define PACKAGE_VERSION "2.69"
| #define PACKAGE_STRING "GNU Autoconf 2.69"
| #define PACKAGE_BUGREPORT "[hidden email]"
| #define PACKAGE_URL "http://www.gnu.org/software/autoconf/"
| #define PACKAGE "autoconf"
| #define VERSION "2.69"
|
| configure: exit 0


===============================================================
Fergus McMenemie               Email: [hidden email]
                               Phone: +44 7721 376021
                               Skype: fergusmcmenemie
===============================================================




Loading...