[GNU Autoconf 2.69] testsuite: 281 282 failed

classic Classic list List threaded Threaded
3 messages Options
Reply | Threaded
Open this post in threaded view
|  
Report Content as Inappropriate

[GNU Autoconf 2.69] testsuite: 281 282 failed

Chengyu Deng
Hi,

After i typed 'make check ', I found two fails:

281: AC_NO_EXECUTABLES (working linker)              FAILED (c.at:221)
282: AC_NO_EXECUTABLES (broken linker)               FAILED (c.at:231)

Best,
Chengyu Deng
Reply | Threaded
Open this post in threaded view
|  
Report Content as Inappropriate

Re: [GNU Autoconf 2.69] testsuite: 281 282 failed

Eric Blake-3
On 06/07/2016 07:57 AM, Chengyu Deng wrote:
> Hi,
>
> After i typed 'make check ', I found two fails:
>
> 281: AC_NO_EXECUTABLES (working linker)              FAILED (c.at:221)
> 282: AC_NO_EXECUTABLES (broken linker)               FAILED (c.at:231)

Thanks for the report; however, it is rather sparse on details.  Can you
look at the testsuite.log to see more details about the failed tests, to
see if it is something about your environment, or if we may have a bug
in the testsuite itself?

--
Eric Blake   eblake redhat com    +1-919-301-3266
Libvirt virtualization library http://libvirt.org


signature.asc (617 bytes) Download Attachment
Reply | Threaded
Open this post in threaded view
|  
Report Content as Inappropriate

Re: [GNU Autoconf 2.69] testsuite: 281 282 failed

Eric Blake-3
[re-adding the list with permission]

On 06/07/2016 01:07 PM, Chengyu Deng wrote:

> #                             -*- compilation -*-
> 281. c.at:221: testing AC_NO_EXECUTABLES (working linker) ...
> ./c.at:221: autoconf --force -W obsolete
> ./c.at:221: /bin/sh -n configure
> stderr:
> ./c.at:221: autoheader
> ./c.at:221: ./configure $configure_options -C
> --- /dev/null   2016-06-02 12:01:26.041890101 -0400
> +++
> /home/dcheng1/download/autoconf-2.69/tests/testsuite.dir/at-groups/281/stderr
>   2016-06-07 14:48:30.353621517 -0400
> @@ -0,0 +1,3 @@
> +configure: error: in
> `/home/dcheng1/download/autoconf-2.69/tests/testsuite.dir/281':
> +configure: error: cannot compute suffix of object files: cannot compile
> +See `config.log' for more details

>> configure:1652: creating cache config.cache
>> configure:1790: checking for gcc
>> configure:1817: result: icc
>> configure:2046: checking for C compiler version
>> configure:2055: icc --version >&5
>> ./configure: line 2057: icc: command not found
>> configure:2066: $? = 127

That's odd - do you have CC set in your environment to something that
doesn't exist?

But it explains the testsuite failures - it's your environment, and not
the testsuite.  Either figure out why icc isn't working, or why
configure is trying to pick icc instead of gcc or cc as the primary C
compiler.

--
Eric Blake   eblake redhat com    +1-919-301-3266
Libvirt virtualization library http://libvirt.org


signature.asc (617 bytes) Download Attachment
Loading...